{"text_format":"1","workbook":"xlsx","n_sheets":9,"sheets":["1 ExpenseReport","2 Missing Receipts Form","3 Receipt itemization","4 Per Diem Form","5 Kilometerage Form","Alcohol","categories and subtotals","FIS accounts","GTFM notes"],"not_rendered":{"charts":0,"images":3,"macros":1,"external_links":1,"defined_names":143,"comments":7,"pivot_tables":0},"unopened":[],"bounds":{"document_bytes":16777216,"sheet_cells":100000,"rows_first":2000,"rows_last":500,"rows_between":2000,"halvings":0,"cell_chars":16384,"cell_head_chars":4096},"cells_cut":0,"cells_raw":0,"read":"whole","date_system":"1900"}

{"sheet":"1 ExpenseReport","index":0,"n_rows":60,"n_cols":35,"rows_kept":60,"cut":false,"hidden":false,"merged":[[3,0,3,5],[15,7,20,7],[15,8,17,8],[18,8,20,8],[1,5,1,13],[6,0,6,1],[5,2,5,5],[6,2,6,5],[4,0,4,4],[8,2,8,5],[5,0,5,1],[7,0,7,1],[7,2,7,5],[9,2,9,5],[11,2,11,5],[10,2,10,5],[1,26,2,29],[13,27,14,27],[13,29,14,29],[13,25,14,25],[2,6,2,13],[4,16,8,22],[9,10,9,12],[6,7,7,13],[13,26,14,26],[13,23,14,23],[39,16,39,21],[13,7,13,11],[15,0,16,5],[13,0,14,5],[14,16,14,21],[30,0,30,5],[31,0,31,5],[29,2,29,5],[27,7,27,8],[25,0,26,5],[27,0,27,5],[23,0,23,5],[21,0,22,5],[17,0,17,5],[29,0,29,1],[11,0,11,1],[10,0,10,1],[12,1,12,5],[41,0,41,5],[42,3,43,5],[28,2,28,5],[28,0,28,1],[34,0,36,5],[39,0,40,4],[54,0,55,5],[50,0,50,5],[46,0,47,5],[53,0,53,1],[53,3,53,5],[51,3,52,5],[51,0,52,1],[51,2,52,2],[48,0,49,4],[58,26,59,30],[31,7,34,7],[35,7,38,7],[59,20,59,24],[48,16,48,21],[51,16,51,21],[52,16,52,21],[53,16,53,21],[54,16,54,21],[46,16,46,21],[47,16,47,21],[57,26,57,29],[40,16,40,21],[43,16,43,21],[44,16,44,21],[45,16,45,21],[49,16,49,21],[50,16,50,21],[41,16,41,21],[44,0,44,1],[42,2,43,2],[42,0,43,1],[44,3,44,5],[42,16,42,21]]}
[null,null,null,null,null,null,null,null,null,null,null,null,null,null,null,null,null,null,null,null,null,null,null,null,null,null,"DOCUMENT #"]
[null,null,null,null,null,"EXPENSE REPORT/ACCOUNTABLE ADVANCE SETTLEMENT",null,null,null,null,null,null,null,null,null,null,"ACCOUNTING INFORMATION"]
[null,null,null,null,null,null,"TO BE COMPLETED BY CLAIMANT",null,null,null,null,null,null,null,null,null,"TO BE COMPLETED BY BUSINESS OFFICER"]
["TO BE COMPLETED BY CLAIMANT"]
[null,null,null,null,null,null,null,null,null,null,null,null,null,null,null,null,"Purpose: Select claim type. Enter code, below, to complete G/L account. If G/L account is not listed, enter appropriate G/L account on \"OTHER\" line.",null,null,null,null,null,null,null,0,"EMPLOYEE FIELD TRIP"]
[{"$f":"IF(A8=\"\",\"\",\"STATEMENT DATE:\")","v":""},null,{"$f":"IF(AND(A8<>\"\",statementDate<>\"0\"),statementDate,\"\")","v":""},null,null,null," NOTE:",null,null,null,null,null,null,null,null,null,null,null,null,null,null,null,null,null,1,"EMPLOYEE CONFERENCE"]
{"$rows_left_out":55}
{"sheet":"2 Missing Receipts Form","index":1,"n_rows":28,"n_cols":6,"rows_kept":28,"cut":false,"hidden":false,"merged":[[23,1,23,3],[26,1,26,3],[0,0,0,5],[1,0,1,5],[2,0,2,5],[21,0,21,5],[22,0,22,5]]}
["MISSING RECEIPTS - Reimbursable Expenses For Which There Is No Original Receipt "]
["This form is used when detailed restaurant bills, boarding passes, documents, and receipts are not available. \nSubmit this form with your  (i) Expense Report Claim and/or (ii) request for payment of AMEX Statements."]
["The following is a detailed list of expenses incurred while conducting business or carrying out related duties on behalf of the University and for which there are no original receipts. Furthermore, I will not be seeking reimbursement from any other source, nor, if the missing receipts are subsequently found, will they be \nre-submitted for reimbursement."]
[]
["Receipt#","Date","Description of Cost","Vendor / Location","Reason for no receipt","Amount $CAD"]
[{"$f":"IFERROR(MATCH('3 Receipt itemization'!A26,'3 Receipt itemization'!AB:AB,0)-25,\"\")","v":""},{"$f":"IFERROR(IF(VLOOKUP($A6,'3 Receipt itemization'!$A:$P,2,FALSE)=0,\"\",VLOOKUP($A6,'3 Receipt itemization'!$A:$P,2,FALSE)),\"\")","v":""},{"$f":"IFERROR(IF(VLOOKUP($A6,'3 Receipt itemization'!$A:$P,7,FALSE)=0,\"\",VLOOKUP($A6,'3 Receipt itemization'!$A:$P,7,FALSE)),\"\")","v":""},{"$f":"IFERROR(IF(VLOOKUP($A6,'3 Receipt itemization'!$A:$P,5,FALSE)=0,\"\",VLOOKUP($A6,'3 Receipt itemization'!$A:$P,5,FALSE)),\"\")","v":""},null,{"$f":"IFERROR(IF(VLOOKUP($A6,'3 Receipt itemization'!$A:$P,4,FALSE)=0,\"\",VLOOKUP($A6,'3 Receipt itemization'!$A:$P,4,FALSE)),\"\")","v":""}]
{"$rows_left_out":23}
{"sheet":"3 Receipt itemization","index":2,"n_rows":92,"n_cols":28,"rows_kept":92,"cut":false,"hidden":false,"merged":[[20,7,23,7]]}
["*** Do not change print setup, rows 1 to 15 are not to be printed ***",null,null,null,null,null,null,null,null,null,null,null,null,null,null,null,null,null,null,null,null,null,null,null,null,null,null,"||||"]
[null,null,null,"Last name",null,{"$f":"IF(surname=0,\"!! Required\",\" \")","v":"!! Required"}]
[null,null,null,"First name",null,{"$f":"IF(firstname=0,\"!! Required\",\" \")","v":"!! Required"}]
[null,null,null,"Title",null,{"$f":"IF(title=0,\"!! Required\",\" \")","v":"!! Required"}]
[null,null,null,"Personnel#",null,{"$f":"IF(empl_no=0,\"!! Required\",\" \")","v":"!! Required"}]
[null,null,null,"Faculty or Department & Address","Cell and Systems Biology",{"$f":"IF(division=0,\"!! Required\",\" \")","v":" "}]
{"$rows_left_out":87}
{"sheet":"4 Per Diem Form","index":3,"n_rows":37,"n_cols":26,"rows_kept":37,"cut":false,"hidden":false,"merged":[[2,0,2,4],[9,0,10,4],[11,0,11,4]]}
["Per Diem Allowance",null,null,null,{"$f":"CONCATENATE(firstname &\" \",surname)","v":" "}]
["[Attach to expense report]"]
["A fixed allowance covering meals and incidental expenses (e.g. gratuities for housekeeping services and bellhops, etc.) may be claimed, without receipts, in lieu of specific expense reimbursement, in Canadian dollars, as follows:\n\nPlease note that it is not permitted to claim a full day per diem when at a conference if the conference fees include a meal component, or if travel begins in the middle of the day.  \n\nEffective Feb 1, 2020: meal allowance rates will change to $80 CAD for travel in Canada and $100 CAD for travel outside of Canada. For long-term travel in excess of 30 consecutive days in one location, the meal allowance rates will be reduced to 75% of the applicable per diem rate.",null,null,null,null,null,null,null,null,null,"Per diem rates for travel prior to Feb 1, 2020"]
[null,null,"In Canada \n$CAD","USA or International \n$CAD",null,null,null,null,null,null,"In Canada \n$CAD","USA or International \n$CAD",null,null,null,null,null,null,null,"In Canada",null,null,null,"US or international"]
["Breakfast",null,15,20,null,null,null,null,null,null,11,15,null,null,null,null,null,null,null,"prior to 1-Feb-2020","2020-02-01",null,null,"prior to 1-Feb-2020","2020-02-01"]
["Lunch",null,20,25,null,null,null,null,null,null,17,22.5,null,null,null,null,null,null,null,"In Canada \n$CAD","In Canada \n$CAD",null,null,"In Canada \n$CAD","In Canada \n$CAD"]
{"$rows_left_out":32}
{"sheet":"5 Kilometerage Form","index":4,"n_rows":29,"n_cols":4,"rows_kept":29,"cut":false,"hidden":false,"merged":[[3,0,3,3],[28,0,28,3],[2,0,2,3],[0,0,0,1]]}
["Kilometerage Allowance",null,null,{"$f":"CONCATENATE(firstname &\" \",surname)","v":" "}]
["[Attach to expense report]"]
["Click here to view additional details/guidelines on Use of Employee Owned Vehicle."]
["All car expenses are covered by the kilometrage rate including maintenance, repair, towing and fuel cost. Additional charges for parking, bridge, ferry and highway tolls while on University business are eligible expenses.  (Note that the reimbursement rates of the granting agency guidelines, or a specific research award, will apply if they are lower than the University rates.)\n\nThe rate allowed for use of a personally owned automobile while on approved University business is 57 cents per kilometre (effective rate from Mar 31, 2016 to Jan 31, 2020 was 0.54 / km).\n\nConversion: Multiply miles by 1.609 to convert to kilometres."]
["CALCULATOR:\nmiles to kms",1,{"$f":"B5*1.609","v":1.609}]
["2020-01-31",null,"2006-09-01"]
{"$rows_left_out":24}
{"sheet":"Alcohol","index":5,"n_rows":23,"n_cols":4,"rows_kept":23,"cut":false,"hidden":false,"merged":[[22,1,22,4]]}
["Guide to Financial Management: Policies and Guidelines regarding alcohol"]
[null,"https://finance.utoronto.ca/?p=1165#hospitality"]
[]
[null,"Hospitality: if you need to calculate how much to deduct for alcohol, tax and tip"]
[null,"  enter details from receipt in the shaded area marked with an asterick (*)"]
[null,"subtotal before tax",100,"*"]
{"$rows_left_out":18}
{"sheet":"categories and subtotals","index":6,"n_rows":52,"n_cols":35,"rows_kept":52,"cut":false,"hidden":false,"merged":[]}
["DO NOT DELETE DATA OR FORMULAS ON THIS PAGE.   ",null,null,null,null,null,null,null,null,null,null,null,null,null,null,null,null,null,null,null,null,null,null,null,null,null,null,null,null,null,null,null,null,null,"||||"]
["***ACCOUNTING INFORMATION FOR UPDATING FIS***"]
[]
["Categories Available to Select are:","GL",null,"KM","subtotals",null,"Tax",null,{"$f":"AD5","v":0},{"$f":"AD6","v":0},{"$f":"$AD7","v":0},{"$f":"$AD8","v":0},{"$f":"$AD9","v":0},{"$f":"AD10","v":0},{"$f":"AD11","v":0},{"$f":"$AD12","v":0},{"$f":"AD13","v":0},{"$f":"AD14","v":0},{"$f":"AD15","v":0},{"$f":"AD16","v":0},{"$f":"AD17","v":0},{"$f":"AD18","v":0},{"$f":"AD19","v":0},{"$f":"AD20","v":0},{"$f":"AD21","v":0},{"$f":"AD22","v":0},{"$f":"AD23","v":0},"FIS account o/s"]
["Airfare: Travel within Canada","84__010",null,{"$f":"SUMIFS('3 Receipt itemization'!$J$26:$J$92,'3 Receipt itemization'!$H$26:$H$92,A5,'3 Receipt itemization'!$I$26:$I$92,\"ECONOMY\")","v":0},{"$f":"SUMIFS('3 Receipt itemization'!$D$26:$D$92,'3 Receipt itemization'!$H$26:$H$92,A5,'3 Receipt itemization'!$I$26:$I$92,\"ECONOMY\")","v":0},null,"ER",null,{"$f":"SUMIFS('3 Receipt itemization'!$D$26:$D$92,'3 Receipt itemization'!$H$26:$H$92,$A5,'3 Receipt itemization'!$N$26:$N$92,I$4,'3 Receipt itemization'!$I$26:$I$92,\"ECONOMY\")","v":0},{"$f":"SUMIFS('3 Receipt itemization'!$D$26:$D$92,'3 Receipt itemization'!$H$26:$H$92,$A5,'3 Receipt itemization'!$N$26:$N$92,J$4,'3 Receipt itemization'!$I$26:$I$92,\"ECONOMY\")","v":0},{"$f":"SUMIFS('3 Receipt itemization'!$D$26:$D$92,'3 Receipt itemization'!$H$26:$H$92,$A5,'3 Receipt itemization'!$N$26:$N$92,K$4,'3 Receipt itemization'!$I$26:$I$92,\"ECONOMY\")","v":0},{"$f":"SUMIFS('3 Receipt itemization'!$D$26:$D$92,'3 Receipt itemization'!$H$26:$H$92,$A5,'3 Receipt itemization'!$N$26:$N$92,L$4,'3 Receipt itemization'!$I$26:$I$92,\"ECONOMY\")","v":0},{"$f":"SUMIFS('3 Receipt itemization'!$D$26:$D$92,'3 Receipt itemization'!$H$26:$H$92,$A5,'3 Receipt itemization'!$N$26:$N$92,M$4,'3 Receipt itemization'!$I$26:$I$92,\"ECONOMY\")","v":0},{"$f":"SUMIFS('3 Receipt itemization'!$D$26:$D$92,'3 Receipt itemization'!$H$26:$H$92,$A5,'3 Receipt itemization'!$N$26:$N$92,N$4,'3 Receipt itemization'!$I$26:$I$92,\"ECONOMY\")","v":0},{"$f":"SUMIFS('3 Receipt itemization'!$D$26:$D$92,'3 Receipt itemization'!$H$26:$H$92,$A5,'3 Receipt itemization'!$N$26:$N$92,O$4,'3 Receipt itemization'!$I$26:$I$92,\"ECONOMY\")","v":0},{"$f":"SUMIFS('3 Receipt itemization'!$D$26:$D$92,'3 Receipt itemization'!$H$26:$H$92,$A5,'3 Receipt itemization'!$N$26:$N$92,P$4,'3 Receipt itemization'!$I$26:$I$92,\"ECONOMY\")","v":0},{"$f":"SUMIFS('3 Receipt itemization'!$D$26:$D$92,'3 Receipt itemization'!$H$26:$H$92,$A5,'3 Receipt itemization'!$N$26:$N$92,Q$4,'3 Receipt itemization'!$I$26:$I$92,\"ECONOMY\")","v":0},{"$f":"SUMIFS('3 Receipt itemization'!$D$26:$D$92,'3 Receipt itemization'!$H$26:$H$92,$A5,'3 Receipt itemization'!$N$26:$N$92,R$4,'3 Receipt itemization'!$I$26:$I$92,\"ECONOMY\")","v":0},{"$f":"SUMIFS('3 Receipt itemization'!$D$26:$D$92,'3 Receipt itemization'!$H$26:$H$92,$A5,'3 Receipt itemization'!$N$26:$N$92,S$4,'3 Receipt itemization'!$I$26:$I$92,\"ECONOMY\")","v":0},{"$f":"SUMIFS('3 Receipt itemization'!$D$26:$D$92,'3 Receipt itemization'!$H$26:$H$92,$A5,'3 Receipt itemization'!$N$26:$N$92,T$4,'3 Receipt itemization'!$I$26:$I$92,\"ECONOMY\")","v":0},{"$f":"SUMIFS('3 Receipt itemization'!$D$26:$D$92,'3 Receipt itemization'!$H$26:$H$92,$A5,'3 Receipt itemization'!$N$26:$N$92,U$4,'3 Receipt itemization'!$I$26:$I$92,\"ECONOMY\")","v":0},{"$f":"SUMIFS('3 Receipt itemization'!$D$26:$D$92,'3 Receipt itemization'!$H$26:$H$92,$A5,'3 Receipt itemization'!$N$26:$N$92,V$4,'3 Receipt itemization'!$I$26:$I$92,\"ECONOMY\")","v":0},{"$f":"SUMIFS('3 Receipt itemization'!$D$26:$D$92,'3 Receipt itemization'!$H$26:$H$92,$A5,'3 Receipt itemization'!$N$26:$N$92,W$4,'3 Receipt itemization'!$I$26:$I$92,\"ECONOMY\")","v":0},{"$f":"SUMIFS('3 Receipt itemization'!$D$26:$D$92,'3 Receipt itemization'!$H$26:$H$92,$A5,'3 Receipt itemization'!$N$26:$N$92,X$4,'3 Receipt itemization'!$I$26:$I$92,\"ECONOMY\")","v":0},{"$f":"SUMIFS('3 Receipt itemization'!$D$26:$D$92,'3 Receipt itemization'!$H$26:$H$92,$A5,'3 Receipt itemization'!$N$26:$N$92,Y$4,'3 Receipt itemization'!$I$26:$I$92,\"ECONOMY\")","v":0},{"$f":"SUMIFS('3 Receipt itemization'!$D$26:$D$92,'3 Receipt itemization'!$H$26:$H$92,$A5,'3 Receipt itemization'!$N$26:$N$92,Z$4,'3 Receipt itemization'!$I$26:$I$92,\"ECONOMY\")","v":0},{"$f":"SUMIFS('3 Receipt itemization'!$D$26:$D$92,'3 Receipt itemization'!$H$26:$H$92,$A5,'3 Receipt itemization'!$N$26:$N$92,AA$4,'3 Receipt itemization'!$I$26:$I$92,\"ECONOMY\")","v":0},{"$f":"SUMIFS('3 Receipt itemization'!$D$26:$D$92,'3 Receipt itemization'!$H$26:$H$92,$A5,'3 Receipt itemization'!$N$26:$N$92,\"\",'3 Receipt itemization'!$I$26:$I$92,\"ECONOMY\")","v":0},null,{"$f":"'FIS accounts'!A1","v":0},null,null,null,null,{"$f":"CONCATENATE(IF(I5>0,I$4&\"   \",\"\"),IF(J5>0,J$4&\"   \",\"\"),IF(K5>0,K$4&\"   \",\"\"),IF(L5>0,L$4&\"   \",\"\"),IF(M5>0,M$4&\"   \",\"\"),IF(N5>0,N$4&\"   \",\"\"),IF(O5>0,O$4&\"   \",\"\"),IF(P5>0,P$4&\"   \",\"\"),IF(Q5>0,Q$4&\"   \",\"\"),IF(R5>0,R$4&\"   \",\"\"),IF(S5>0,S$4&\"   \",\"\"),IF(T5>0,T$4&\"   \",\"\"),IF(U5>0,U$4&\"   \",\"\"),IF(V5>0,V$4&\"   \",\"\"),IF(W5>0,W$4&\"   \",\"\"),IF(X5>0,X$4&\"   \",\"\"),IF(Y5>0,Y$4&\"   \",\"\"),IF(Z5>0,Z$4&\"   \",\"\"),IF(AA5>0,AA$4&\"   \",\"\"))","v":""}]
["Airfare: Travel to USA from Ontario","84__010",null,{"$f":"SUMIFS('3 Receipt itemization'!$J$26:$J$92,'3 Receipt itemization'!$H$26:$H$92,A6,'3 Receipt itemization'!$I$26:$I$92,\"ECONOMY\")","v":0},{"$f":"SUMIFS('3 Receipt itemization'!$D$26:$D$92,'3 Receipt itemization'!$H$26:$H$92,A6,'3 Receipt itemization'!$I$26:$I$92,\"ECONOMY\")","v":0},null,"EE",null,{"$f":"SUMIFS('3 Receipt itemization'!$D$26:$D$92,'3 Receipt itemization'!$H$26:$H$92,$A6,'3 Receipt itemization'!$N$26:$N$92,I$4,'3 Receipt itemization'!$I$26:$I$92,\"ECONOMY\")","v":0},{"$f":"SUMIFS('3 Receipt itemization'!$D$26:$D$92,'3 Receipt itemization'!$H$26:$H$92,$A6,'3 Receipt itemization'!$N$26:$N$92,J$4,'3 Receipt itemization'!$I$26:$I$92,\"ECONOMY\")","v":0},{"$f":"SUMIFS('3 Receipt itemization'!$D$26:$D$92,'3 Receipt itemization'!$H$26:$H$92,$A6,'3 Receipt itemization'!$N$26:$N$92,K$4,'3 Receipt itemization'!$I$26:$I$92,\"ECONOMY\")","v":0},{"$f":"SUMIFS('3 Receipt itemization'!$D$26:$D$92,'3 Receipt itemization'!$H$26:$H$92,$A6,'3 Receipt itemization'!$N$26:$N$92,L$4,'3 Receipt itemization'!$I$26:$I$92,\"ECONOMY\")","v":0},{"$f":"SUMIFS('3 Receipt itemization'!$D$26:$D$92,'3 Receipt itemization'!$H$26:$H$92,$A6,'3 Receipt itemization'!$N$26:$N$92,M$4,'3 Receipt itemization'!$I$26:$I$92,\"ECONOMY\")","v":0},{"$f":"SUMIFS('3 Receipt itemization'!$D$26:$D$92,'3 Receipt itemization'!$H$26:$H$92,$A6,'3 Receipt itemization'!$N$26:$N$92,N$4,'3 Receipt itemization'!$I$26:$I$92,\"ECONOMY\")","v":0},{"$f":"SUMIFS('3 Receipt itemization'!$D$26:$D$92,'3 Receipt itemization'!$H$26:$H$92,$A6,'3 Receipt itemization'!$N$26:$N$92,O$4,'3 Receipt itemization'!$I$26:$I$92,\"ECONOMY\")","v":0},{"$f":"SUMIFS('3 Receipt itemization'!$D$26:$D$92,'3 Receipt itemization'!$H$26:$H$92,$A6,'3 Receipt itemization'!$N$26:$N$92,P$4,'3 Receipt itemization'!$I$26:$I$92,\"ECONOMY\")","v":0},{"$f":"SUMIFS('3 Receipt itemization'!$D$26:$D$92,'3 Receipt itemization'!$H$26:$H$92,$A6,'3 Receipt itemization'!$N$26:$N$92,Q$4,'3 Receipt itemization'!$I$26:$I$92,\"ECONOMY\")","v":0},{"$f":"SUMIFS('3 Receipt itemization'!$D$26:$D$92,'3 Receipt itemization'!$H$26:$H$92,$A6,'3 Receipt itemization'!$N$26:$N$92,R$4,'3 Receipt itemization'!$I$26:$I$92,\"ECONOMY\")","v":0},{"$f":"SUMIFS('3 Receipt itemization'!$D$26:$D$92,'3 Receipt itemization'!$H$26:$H$92,$A6,'3 Receipt itemization'!$N$26:$N$92,S$4,'3 Receipt itemization'!$I$26:$I$92,\"ECONOMY\")","v":0},{"$f":"SUMIFS('3 Receipt itemization'!$D$26:$D$92,'3 Receipt itemization'!$H$26:$H$92,$A6,'3 Receipt itemization'!$N$26:$N$92,T$4,'3 Receipt itemization'!$I$26:$I$92,\"ECONOMY\")","v":0},{"$f":"SUMIFS('3 Receipt itemization'!$D$26:$D$92,'3 Receipt itemization'!$H$26:$H$92,$A6,'3 Receipt itemization'!$N$26:$N$92,U$4,'3 Receipt itemization'!$I$26:$I$92,\"ECONOMY\")","v":0},{"$f":"SUMIFS('3 Receipt itemization'!$D$26:$D$92,'3 Receipt itemization'!$H$26:$H$92,$A6,'3 Receipt itemization'!$N$26:$N$92,V$4,'3 Receipt itemization'!$I$26:$I$92,\"ECONOMY\")","v":0},{"$f":"SUMIFS('3 Receipt itemization'!$D$26:$D$92,'3 Receipt itemization'!$H$26:$H$92,$A6,'3 Receipt itemization'!$N$26:$N$92,W$4,'3 Receipt itemization'!$I$26:$I$92,\"ECONOMY\")","v":0},{"$f":"SUMIFS('3 Receipt itemization'!$D$26:$D$92,'3 Receipt itemization'!$H$26:$H$92,$A6,'3 Receipt itemization'!$N$26:$N$92,X$4,'3 Receipt itemization'!$I$26:$I$92,\"ECONOMY\")","v":0},{"$f":"SUMIFS('3 Receipt itemization'!$D$26:$D$92,'3 Receipt itemization'!$H$26:$H$92,$A6,'3 Receipt itemization'!$N$26:$N$92,Y$4,'3 Receipt itemization'!$I$26:$I$92,\"ECONOMY\")","v":0},{"$f":"SUMIFS('3 Receipt itemization'!$D$26:$D$92,'3 Receipt itemization'!$H$26:$H$92,$A6,'3 Receipt itemization'!$N$26:$N$92,Z$4,'3 Receipt itemization'!$I$26:$I$92,\"ECONOMY\")","v":0},{"$f":"SUMIFS('3 Receipt itemization'!$D$26:$D$92,'3 Receipt itemization'!$H$26:$H$92,$A6,'3 Receipt itemization'!$N$26:$N$92,AA$4,'3 Receipt itemization'!$I$26:$I$92,\"ECONOMY\")","v":0},{"$f":"SUMIFS('3 Receipt itemization'!$D$26:$D$92,'3 Receipt itemization'!$H$26:$H$92,$A6,'3 Receipt itemization'!$N$26:$N$92,\"\",'3 Receipt itemization'!$I$26:$I$92,\"ECONOMY\")","v":0},null,{"$f":"'FIS accounts'!A2","v":0},null,null,null,null,{"$f":"CONCATENATE(IF(I6>0,I$4&\"   \",\"\"),IF(J6>0,J$4&\"   \",\"\"),IF(K6>0,K$4&\"   \",\"\"),IF(L6>0,L$4&\"   \",\"\"),IF(M6>0,M$4&\"   \",\"\"),IF(N6>0,N$4&\"   \",\"\"),IF(O6>0,O$4&\"   \",\"\"),IF(P6>0,P$4&\"   \",\"\"),IF(Q6>0,Q$4&\"   \",\"\"),IF(R6>0,R$4&\"   \",\"\"),IF(S6>0,S$4&\"   \",\"\"),IF(T6>0,T$4&\"   \",\"\"),IF(U6>0,U$4&\"   \",\"\"),IF(V6>0,V$4&\"   \",\"\"),IF(W6>0,W$4&\"   \",\"\"),IF(X6>0,X$4&\"   \",\"\"),IF(Y6>0,Y$4&\"   \",\"\"),IF(Z6>0,Z$4&\"   \",\"\"),IF(AA6>0,AA$4&\"   \",\"\"))","v":""}]
{"$rows_left_out":47}
{"sheet":"FIS accounts","index":7,"n_rows":6,"n_cols":2,"rows_kept":6,"cut":false,"hidden":false,"merged":[]}
[null,"Enter FIS accounts for your specific areas in COLUMN A"]
[]
[]
[null," i.e.      1xxxx / 1xxxxx FAS"]
[null,"xxxxx / 2xxxxx Research: J.Doe"]
[null,"[LIST UP TO A MAX OF 19 ACCOUNTS]"]
{"$rows_left_out":1}
{"sheet":"GTFM notes","index":8,"n_rows":18,"n_cols":3,"rows_kept":18,"cut":false,"hidden":true,"merged":[[5,0,5,3],[0,1,0,2],[1,0,1,3],[2,0,2,3],[3,0,3,3],[4,0,4,3]]}
[null,"Click to review the Guide to Financial Management:  \nTravel and Other Reimbursable Expenses – Policies and Guidelines"]
[]
["The purpose and relevance to University business of each expenditure must be clearly documented such that the purpose could be reasonably understood by an outside party."]
["All expense claims should be submitted for reimbursement on a timely basis, and it would be unreasonable to expect reimbursement after more than one year after the related expenses have been incurred.\n"]
["Original detailed receipts and proof of payment must accompany the expense report.  If you are missing reciepts, please complete the Missing Receipts Form."]
["Please note that receipts are very important for income tax purposes. The Canada Revenue Agency considers all amounts paid to individuals without receipts to be income to the individual and, therefore, taxable."]
{"$rows_left_out":12}